Reaction Details
TargetSerine/threonine-protein kinase PLK1
LigandBDBM50339793
Substrate/Competitorn/a
Meas. Tech.ChEMBL_735641 (CHEMBL1693343)
IC50 69±n/a nM
Citation Solanki, SInnocenti, PMas-Droux, CBoxall, KBarillari, Cvan Montfort, RLAherne, GWBayliss, RHoelder, S Benzimidazole inhibitors induce a DFG-out conformation of never in mitosis gene A-related kinase 2 (Nek2) without binding to the back pocket and reveal a nonlinear structure-activity relationship. J Med Chem54:1626-39 (2011) 
 
Serine/threonine-protein kinase PLK1
Name:Serine/threonine-protein kinase PLK1
Type:Serine/threonine-protein kinase
Mol. Mass.:68277.16
Organism:Homo sapiens (Human)
Description:P53350
Residue:603
BDBM50339793
NameBDBM50339793
Synonyms:3-(benzyloxy)-5-(6-(1-methylpiperidin-4-yloxy)-1H-benzo[d]imidazol-1-yl)thiophene-2-carboxamide | CHEMBL1689159
TypeSmall organic molecule
Emp. Form.C25H26N4O3S
Mol. Mass.462.564
SMILESCN1CCC(CC1)Oc1ccc2ncn(-c3cc(OCc4ccccc4)c(s3)C(N)=O)c2c1