Reaction Details
TargetCarbonic anhydrase 1
LigandBDBM26978
Substrate/Competitorn/a
Meas. Tech.ChEMBL_735670 (CHEMBL1693485)
pH7.5±n/a
Ki>300000000±n/a nM
Commentsextracted
Citation Cincinelli, AMartellini, TInnocenti, AScozzafava, ASupuran, CT Purification and inhibition studies with anions and sulfonamides of ana-carbonic anhydrase from the Antarctic seal Leptonychotes weddellii. Bioorg Med Chem19:1847-51 (2011) 
 
Carbonic anhydrase 1
Name:Carbonic anhydrase 1
Type:Enzyme
Mol. Mass.:28873.37
Organism:Homo sapiens (Human)
Description:P00915
Residue:261
BDBM26978
NameBDBM26978
Synonyms:BDBM50098540 CHEMBL1644027 fluoride | fluoride ion
TypeIon
Emp. Form.F
Mol. Mass.18.9989518
SMILES[F-]