Reaction Details
TargetCarbonic anhydrase 2
LigandBDBM13076
Substrate/Competitorn/a
Meas. Tech.ChEMBL_735671 (CHEMBL1693486)
pH7.5±n/a
Ki 290±n/a nM
Commentsextracted
Citation Cincinelli, AMartellini, TInnocenti, AScozzafava, ASupuran, CT Purification and inhibition studies with anions and sulfonamides of ana-carbonic anhydrase from the Antarctic seal Leptonychotes weddellii. Bioorg Med Chem19:1847-51 (2011) 
 
Carbonic anhydrase 2
Name:Carbonic anhydrase 2
Type:Enzyme
Mol. Mass.:29250.71
Organism:Homo sapiens (Human)
Description:P00918
Residue:260
BDBM13076
NameBDBM13076
Synonyms:6-chloro-1,1-dioxo-3,4-dihydro-2H-1,2,4-benzothiadiazine-7-sulfonamide Dichlothiazide Hydrochlorothiazide JFD00715 cid_3639
TypeSmall organic molecule
Emp. Form.C7H8ClN3O4S2
Mol. Mass.297.739
SMILESNS(=O)(=O)c1cc2c(NCNS2(=O)=O)cc1Cl