Reaction Details
TargetL-cysteine:1D-myo-inositol 2-amino-2-deoxy-alpha-D-glucopyranoside ligase
LigandBDBM50290686
Substrate/Competitorn/a
Meas. Tech.ChEMBL_740790 (CHEMBL1763891)
IC50>5000000±n/a nM
Citation Gutierrez-Lugo, MTBewley, CA Susceptibility and mode of binding of the Mycobacterium tuberculosis cysteinyl transferase mycothiol ligase to tRNA synthetase inhibitors. Bioorg Med Chem Lett21:2480-3 (2011) 
 
L-cysteine:1D-myo-inositol 2-amino-2-deoxy-alpha-D-glucopyranoside ligase
Name:L-cysteine:1D-myo-inositol 2-amino-2-deoxy-alpha-D-glucopyranoside ligase
Type:PROTEIN
Mol. Mass.:45583.42
Organism:Mycobacterium tuberculosis
Description:ChEMBL_754210
Residue:414
BDBM50290686
NameBDBM50290686
Synonyms:9-((E)-4-((2S,3R,4R,5S)-3,4-dihydroxy-5-(((2S,3S)-3-((2S,3S)-3-hydroxybutan-2-yl)oxiran-2-yl)methyl)-tetrahydro-2H-pyran-2-yl)-3-methylbut-2-enoyloxy)nonanoic acid 9-(4-((2S,3R,4R,5S)-3,4-dihydroxy-5-(((2S,3S)-3-((2S,3S)-3-hydroxybutan-2-yl)oxiran-2-yl)methyl)-tetrahydro-2H-pyran-2-yl)-3-methylbut-2-enoyloxy)nonanoic acid BRL-4910A CHEMBL719 MUPIROCIN cid_446596
TypeSmall organic molecule
Emp. Form.C26H44O9
Mol. Mass.500.6222
SMILESC[C@H](O)[C@H](C)[C@@H]1O[C@H]1C[C@H]1CO[C@@H](C\C(C)=C\C(=O)OCCCCCCCCC(O)=O)[C@H](O)[C@@H]1O