Reaction Details
TargetSqualene synthase
LigandBDBM50339923
Substrate/Competitorn/a
Meas. Tech.ChEMBL_740875 (CHEMBL1763976)
IC50 1900±n/a nM
Citation Griebenow, NFlessner, TBuchmueller, ARaabe, MBischoff, HKolkhof, P Identification and optimization of tetrahydro-2H-3-benzazepin-2-ones as squalene synthase inhibitors. Bioorg Med Chem Lett21:2554-8 (2011) 
 
Squalene synthase
Name:Squalene synthase
Type:PROTEIN
Mol. Mass.:48114.76
Organism:Homo sapiens (Human)
Description:ChEMBL_1352847
Residue:417
BDBM50339923
NameBDBM50339923
Synonyms:CHEMBL1761655 | trans-rac-2-(5-(2-methoxyphenyl)-7-chloro-1-isobutyl-2-oxo-4,5-dihydro-1H-benzo[d]azepin-3(2H)-yl)acetic acid
TypeSmall organic molecule
Emp. Form.C23H26ClNO4
Mol. Mass.415.91
SMILESCOc1ccccc1[C@H]1CN(CC(O)=O)C(=O)[C@H](CC(C)C)c2ccc(Cl)cc12