Reaction Details
TargetAdenosine receptor A2a
LigandBDBM50340035
Substrate/Competitorn/a
Meas. Tech.ChEMBL_739869 (CHEMBL1762929)
Ki 15.6±n/a nM
Citation Harris, JMNeustadt, BRZhang, HLachowicz, JCohen-Williams, MVarty, GHao, JStamford, AW Potent and selective adenosine A(2A) receptor antagonists: [1,2,4]-triazolo[4,3-c]pyrimidin-3-ones. Bioorg Med Chem Lett21:2497-501 (2011) 
 
Adenosine receptor A2a
Name:Adenosine receptor A2a
Type:G Protein-Coupled Receptor (GPCR)
Mol. Mass.:44716.46
Organism:Homo sapiens (Human)
Description:P29274
Residue:412
BDBM50340035
NameBDBM50340035
Synonyms:5-amino-2-(3-chlorobenzyl)-7-(2-(4-(2-fluoro-4-(2-methoxyethoxy)phenyl)piperazin-1-yl)ethyl)-2H-pyrazolo[4,3-e][1,2,4]triazolo[4,3-c]pyrimidin-3(7H)-one | CHEMBL1762635
TypeSmall organic molecule
Emp. Form.C28H31ClFN9O3
Mol. Mass.596.056
SMILESCOCCOc1ccc(N2CCN(CCn3ncc4c3nc(N)n3c4nn(Cc4cccc(Cl)c4)c3=O)CC2)c(F)c1