Reaction Details
TargetAdenosine receptor A2a
LigandBDBM50340042
Substrate/Competitorn/a
Meas. Tech.ChEMBL_739869 (CHEMBL1762929)
Ki 8.9±n/a nM
Citation Harris, JMNeustadt, BRZhang, HLachowicz, JCohen-Williams, MVarty, GHao, JStamford, AW Potent and selective adenosine A(2A) receptor antagonists: [1,2,4]-triazolo[4,3-c]pyrimidin-3-ones. Bioorg Med Chem Lett21:2497-501 (2011) 
 
Adenosine receptor A2a
Name:Adenosine receptor A2a
Type:G Protein-Coupled Receptor (GPCR)
Mol. Mass.:44716.46
Organism:Homo sapiens (Human)
Description:P29274
Residue:412
BDBM50340042
NameBDBM50340042
Synonyms:5-amino-2-benzyl-7-(2-(4-(methylsulfonyl)piperazin-1-yl)ethyl)-2H-pyrazolo[4,3-e][1,2,4]triazolo[4,3-c]pyrimidin-3(7H)-one | CHEMBL1762628
TypeSmall organic molecule
Emp. Form.C20H25N9O3S
Mol. Mass.471.536
SMILESCS(=O)(=O)N1CCN(CCn2ncc3c4nn(Cc5ccccc5)c(=O)n4c(N)nc23)CC1