Reaction Details
TargetAdenosine receptor A2a
LigandBDBM50340057
Substrate/Competitorn/a
Meas. Tech.ChEMBL_739869 (CHEMBL1762929)
Ki 1±n/a nM
Citation Harris, JMNeustadt, BRZhang, HLachowicz, JCohen-Williams, MVarty, GHao, JStamford, AW Potent and selective adenosine A(2A) receptor antagonists: [1,2,4]-triazolo[4,3-c]pyrimidin-3-ones. Bioorg Med Chem Lett21:2497-501 (2011) 
 
Adenosine receptor A2a
Name:Adenosine receptor A2a
Type:G Protein-Coupled Receptor (GPCR)
Mol. Mass.:44716.46
Organism:Homo sapiens (Human)
Description:P29274
Residue:412
BDBM50340057
NameBDBM50340057
Synonyms:5-amino-2-benzyl-7-phenyl-[1,2,4]triazolo[4,3-c]pyrimidin-3(2H)-one | CHEMBL1762506
TypeSmall organic molecule
Emp. Form.C18H15N5O
Mol. Mass.317.3446
SMILESNc1nc(cc2nn(Cc3ccccc3)c(=O)n12)-c1ccccc1