Reaction Details
TargetCannabinoid receptor 1
LigandBDBM50340316
Substrate/Competitorn/a
Meas. Tech.ChEMBL_741486 (CHEMBL1763801)
IC50>17000±n/a nM
Citation Trotter, BWNanda, KKBurgey, CSPotteiger, CMDeng, JZGreen, AIHartnett, JCKett, NRWu, ZHenze, DADella Penna, KDesai, RLeitl, MDLemaire, WWhite, RBYeh, SUrban, MOKane, SAHartman, GDBilodeau, MT Imidazopyridine CB2 agonists: optimization of CB2/CB1 selectivity and implications for in vivo analgesic efficacy. Bioorg Med Chem Lett21:2354-8 (2011) 
 
Cannabinoid receptor 1
Name:Cannabinoid receptor 1
Type:G Protein-Coupled Receptor (GPCR)
Mol. Mass.:52868.96
Organism:Homo sapiens (Human)
Description:P21554
Residue:472
BDBM50340316
NameBDBM50340316
Synonyms:3-cyclopropyl-N-(dicyclopropylmethyl)imidazo[1,5-a]pyridine-1-carboxamide | CHEMBL1760936
TypeSmall organic molecule
Emp. Form.C18H21N3O
Mol. Mass.295.3788
SMILESO=C(NC(C1CC1)C1CC1)c1nc(C2CC2)n2ccccc12