Reaction Details
TargetMelatonin receptor type 1B
LigandBDBM50340330
Substrate/Competitorn/a
Meas. Tech.ChEMBL_741505 (CHEMBL1763820)
Ki 117±n/a nM
Citation Jeanty, MSuzenet, FDelagrange, PNosjean, OBoutin, JACaignard, DHGuillaumet, G Design and synthesis of 1-(2-alkanamidoethyl)-6-methoxy-7-azaindole derivatives as potent melatonin agonists. Bioorg Med Chem Lett21:2316-9 (2011) 
 
Melatonin receptor type 1B
Name:Melatonin receptor type 1B
Type:Enzyme
Mol. Mass.:40203.54
Organism:Homo sapiens (Human)
Description:P49286
Residue:362
BDBM50340330
NameBDBM50340330
Synonyms:7-azamelatonin N-[2-(5-Methoxy-1H-pyrrolo[2,3-b]pyridin-3-yl)-ethyl]-acetamide
TypeSmall organic molecule
Emp. Form.C12H15N3O2
Mol. Mass.233.2664
SMILESCOc1cnc2[nH]cc(CCNC(C)=O)c2c1