Reaction Details
TargetMelatonin receptor type 1A
LigandBDBM50340333
Substrate/Competitorn/a
Meas. Tech.ChEMBL_741504 (CHEMBL1763819)
Ki 1210±n/a nM
Citation Jeanty, MSuzenet, FDelagrange, PNosjean, OBoutin, JACaignard, DHGuillaumet, G Design and synthesis of 1-(2-alkanamidoethyl)-6-methoxy-7-azaindole derivatives as potent melatonin agonists. Bioorg Med Chem Lett21:2316-9 (2011) 
 
Melatonin receptor type 1A
Name:Melatonin receptor type 1A
Type:Enzyme
Mol. Mass.:39392.94
Organism:Homo sapiens (Human)
Description:P48039
Residue:350
BDBM50340333
NameBDBM50340333
Synonyms:CHEMBL1760952 | N-(2-(3-((4-(3-chlorophenyl)piperazin-1-yl)methyl)-6-methoxy-1H-pyrrolo[2,3-b]pyridin-1-yl)ethyl)acetamide
TypeSmall organic molecule
Emp. Form.C23H28ClN5O2
Mol. Mass.441.954
SMILESCOc1ccc2c(CN3CCN(CC3)c3cccc(Cl)c3)cn(CCNC(C)=O)c2n1