Reaction Details
TargetMelatonin receptor type 1A
LigandBDBM50340338
Substrate/Competitorn/a
Meas. Tech.ChEMBL_741504 (CHEMBL1763819)
Ki 1.3±n/a nM
Citation Jeanty, MSuzenet, FDelagrange, PNosjean, OBoutin, JACaignard, DHGuillaumet, G Design and synthesis of 1-(2-alkanamidoethyl)-6-methoxy-7-azaindole derivatives as potent melatonin agonists. Bioorg Med Chem Lett21:2316-9 (2011) 
 
Melatonin receptor type 1A
Name:Melatonin receptor type 1A
Type:Enzyme
Mol. Mass.:39392.94
Organism:Homo sapiens (Human)
Description:P48039
Residue:350
BDBM50340338
NameBDBM50340338
Synonyms:CHEMBL1760947 | N-(2-(6-Methoxy-1H-pyrrolo[2,3-b]pyridin-1-yl)ethyl)butyramide
TypeSmall organic molecule
Emp. Form.C14H19N3O2
Mol. Mass.261.3196
SMILESCCCC(=O)NCCn1ccc2ccc(OC)nc12