Reaction Details
Target3 beta-hydroxysteroid dehydrogenase/Delta 5-->4-isomerase
LigandBDBM50340480
Substrate/Competitorn/a
Meas. Tech.ChEMBL_741233 (CHEMBL1764602)
IC50 43000±n/a nM
Citation Thomas, STYang, XSampson, NS Inhibition of the M. tuberculosis 3β-hydroxysteroid dehydrogenase by azasteroids. Bioorg Med Chem Lett21:2216-9 (2011) 
 
3 beta-hydroxysteroid dehydrogenase/Delta 5-->4-isomerase
Name:3 beta-hydroxysteroid dehydrogenase/Delta 5-->4-isomerase
Synonyms:3BHS_MYCTU
Type:PROTEIN
Mol. Mass.:40743.62
Organism:Mycobacterium tuberculosis
Description:ChEMBL_741233
Residue:370
BDBM50340480
NameBDBM50340480
TypeSmall organic molecule
Emp. Form.C27H42N2O2
Mol. Mass.426.6346
SMILESCCN(CC)C(=O)[C@H]1CC[C@H]2[C@@H]3CN4CCCCC5=C4[C@](C)(CCC5=O)[C@H]3CC[C@]12C