Reaction Details
TargetCaspase-8
LigandBDBM50273338
Substrate/Competitorn/a
Meas. Tech.ChEMBL_741342 (CHEMBL1764811)
IC50>50000±n/a nM
Citation Chu, WRothfuss, JZhou, DMach, RH Synthesis and evaluation of isatin analogs as caspase-3 inhibitors: introduction of a hydrophilic group increases potency in a whole cell assay. Bioorg Med Chem Lett21:2192-7 (2011) 
 
Caspase-8
Name:Caspase-8
Type:Enzyme
Mol. Mass.:55373.89
Organism:Homo sapiens (Human)
Description:Q14790
Residue:479
BDBM50273338
NameBDBM50273338
Synonyms:(S)-1-((1-(2-Fluoroethyl)-1H-[1,2,3]-triazol-4-yl)methyl)-5-(2(2,4-difluorophenoxymethyl)-pyrrolidine-1-sulfonyl)isatin | CHEMBL456799
TypeSmall organic molecule
Emp. Form.C24H22F3N5O5S
Mol. Mass.549.522
SMILESFCCn1cc(CN2C(=O)C(=O)c3cc(ccc23)S(=O)(=O)N2CCC[C@H]2COc2ccc(F)cc2F)nn1