Reaction Details
TargetCaspase-3
LigandBDBM10351
Substrate/Competitorn/a
Meas. Tech.ChEMBL_741337 (CHEMBL1764806)
EC50 450±n/a nM
Citation Chu, WRothfuss, JZhou, DMach, RH Synthesis and evaluation of isatin analogs as caspase-3 inhibitors: introduction of a hydrophilic group increases potency in a whole cell assay. Bioorg Med Chem Lett21:2192-7 (2011) 
 
Caspase-3
Name:Caspase-3
Type:Hydrolase; heterotetramer of two heterodimers
Mol. Mass.:31607.55
Organism:Homo sapiens (Human)
Description:n/a
Residue:277
BDBM10351
NameBDBM10351
Synonyms:1-(4-Methoxybenzyl)-5-(2-(pyridin-3-yl-oxymethyl)-pyrolidine-1-sulfonyl)-1H-indole-2,3-dione Pyridine Analogue 21c
TypeSmall organic molecule
Emp. Form.C26H25N3O6S
Mol. Mass.507.558
SMILESCOc1ccc(CN2C(=O)C(=O)c3cc(ccc23)S(=O)(=O)N2CCC[C@H]2COc2cccnc2)cc1