Reaction Details
TargetAmine oxidase [flavin-containing] B
LigandBDBM50340659
Substrate/Competitorn/a
Meas. Tech.ChEMBL_739586 (CHEMBL1763412)
IC50 234±n/a nM
Citation Delogu, GPicciau, CFerino, GQuezada, EPodda, GUriarte, EViña, D Synthesis, human monoamine oxidase inhibitory activity and molecular docking studies of 3-heteroarylcoumarin derivatives. Eur J Med Chem46:1147-52 (2011) 
 
Amine oxidase [flavin-containing] B
Name:Amine oxidase [flavin-containing] B
Type:Protein
Mol. Mass.:58768.76
Organism:Homo sapiens (Human)
Description:P27338
Residue:520
BDBM50340659
NameBDBM50340659
Synonyms:6-Methoxy-3-(thiophen-3-yl)coumarin | CHEMBL1761764
TypeSmall organic molecule
Emp. Form.C14H10O3S
Mol. Mass.258.292
SMILESCOc1ccc2oc(=O)c(cc2c1)-c1ccsc1