Reaction Details
TargetNociceptin receptor
LigandBDBM50094634
Substrate/Competitorn/a
Meas. Tech.ChEMBL_740151 (CHEMBL1763211)
IC50 30±n/a nM
Citation Del Giudice, MRBorioni, ABastanzio, GSbraccia, MMustazza, CSestili, I Synthesis and pharmacological evaluation of bivalent antagonists of the nociceptin opioid receptor. Eur J Med Chem46:1207-21 (2011) 
 
Nociceptin receptor
Name:Nociceptin receptor
Type:G Protein-Coupled Receptor (GPCR)
Mol. Mass.:40702.87
Organism:Homo sapiens (Human)
Description:P41146
Residue:370
BDBM50094634
NameBDBM50094634
Synonyms:CHEMBL140979 N-(4-amino-2-methylquinolin-6-yl)-2-((4-ethylphenoxy)methyl)benzamide
TypeSmall organic molecule
Emp. Form.C26H25N3O2
Mol. Mass.411.4956
SMILESCCc1ccc(OCc2ccccc2C(=O)Nc2ccc3nc(C)cc(N)c3c2)cc1