Reaction Details
TargetKappa-type opioid receptor
LigandBDBM50340691
Substrate/Competitorn/a
Meas. Tech.ChEMBL_740153 (CHEMBL1763213)
IC50 1049±n/a nM
Citation Del Giudice, MRBorioni, ABastanzio, GSbraccia, MMustazza, CSestili, I Synthesis and pharmacological evaluation of bivalent antagonists of the nociceptin opioid receptor. Eur J Med Chem46:1207-21 (2011) 
 
Kappa-type opioid receptor
Name:Kappa-type opioid receptor
Type:G Protein-Coupled Receptor (GPCR)
Mol. Mass.:42648.76
Organism:Homo sapiens (Human)
Description:P41145
Residue:380
BDBM50340691
NameBDBM50340691
Synonyms:CHEMBL1762387 | N,N'-bis[[4-[[2-[[(4-amino-2-methylquinolin-6-yl)amino]carbonyl]phenyl]methoxy]phenyl]methyl]-1,9-nonanediamine
TypeSmall organic molecule
Emp. Form.C59H64N8O4
Mol. Mass.949.1907
SMILESCc1cc(N)c2cc(NC(=O)c3ccccc3COc3ccc(CNCCCCCCCCCNCc4ccc(OCc5ccccc5C(=O)Nc5ccc6nc(C)cc(N)c6c5)cc4)cc3)ccc2n1