Reaction Details
TargetKappa-type opioid receptor
LigandBDBM50340694
Substrate/Competitorn/a
Meas. Tech.ChEMBL_740153 (CHEMBL1763213)
IC50 5924±n/a nM
Citation Del Giudice, MRBorioni, ABastanzio, GSbraccia, MMustazza, CSestili, I Synthesis and pharmacological evaluation of bivalent antagonists of the nociceptin opioid receptor. Eur J Med Chem46:1207-21 (2011) 
 
Kappa-type opioid receptor
Name:Kappa-type opioid receptor
Type:G Protein-Coupled Receptor (GPCR)
Mol. Mass.:42648.76
Organism:Homo sapiens (Human)
Description:P41145
Residue:380
BDBM50340694
NameBDBM50340694
Synonyms:CHEMBL1762398 | N-(4-amino-2-methylquinolin-6-yl)-2-[4-(butylaminomethyl)phenoxymethyl]benzamide
TypeSmall organic molecule
Emp. Form.C29H32N4O2
Mol. Mass.468.59
SMILESCCCCNCc1ccc(OCc2ccccc2C(=O)Nc2ccc3nc(C)cc(N)c3c2)cc1