Reaction Details
TargetKappa-type opioid receptor
LigandBDBM50340697
Substrate/Competitorn/a
Meas. Tech.ChEMBL_740153 (CHEMBL1763213)
IC50 1850±n/a nM
Citation Del Giudice, MRBorioni, ABastanzio, GSbraccia, MMustazza, CSestili, I Synthesis and pharmacological evaluation of bivalent antagonists of the nociceptin opioid receptor. Eur J Med Chem46:1207-21 (2011) 
 
Kappa-type opioid receptor
Name:Kappa-type opioid receptor
Type:G Protein-Coupled Receptor (GPCR)
Mol. Mass.:42648.76
Organism:Homo sapiens (Human)
Description:P41145
Residue:380
BDBM50340697
NameBDBM50340697
Synonyms:CHEMBL1762401 | N-(4-amino-2-methylquinolin-6-yl)-2-[4-(heptylaminomethyl)phenoxymethyl]benzamide
TypeSmall organic molecule
Emp. Form.C32H38N4O2
Mol. Mass.510.6697
SMILESCCCCCCCNCc1ccc(OCc2ccccc2C(=O)Nc2ccc3nc(C)cc(N)c3c2)cc1