Reaction Details
TargetMu-type opioid receptor
LigandBDBM50340703
Substrate/Competitorn/a
Meas. Tech.ChEMBL_740229 (CHEMBL1764074)
IC50 4885±n/a nM
Citation Del Giudice, MRBorioni, ABastanzio, GSbraccia, MMustazza, CSestili, I Synthesis and pharmacological evaluation of bivalent antagonists of the nociceptin opioid receptor. Eur J Med Chem46:1207-21 (2011) 
 
Mu-type opioid receptor
Name:Mu-type opioid receptor
Type:G Protein-Coupled Receptor (GPCR)
Mol. Mass.:44789.51
Organism:Homo sapiens (Human)
Description:P35372
Residue:400
BDBM50340703
NameBDBM50340703
Synonyms:CHEMBL1762407 | N-(4-amino-2-methylquinolin-6-yl)-2-[4-(5-aminopentylaminomethyl)phenoxymethyl]benzamide
TypeSmall organic molecule
Emp. Form.C30H35N5O2
Mol. Mass.497.6312
SMILESCc1cc(N)c2cc(NC(=O)c3ccccc3COc3ccc(CNCCCCCN)cc3)ccc2n1