Reaction Details
TargetNociceptin receptor
LigandBDBM50340708
Substrate/Competitorn/a
Meas. Tech.ChEMBL_740151 (CHEMBL1763211)
IC50 5.5±n/a nM
Citation Del Giudice, MRBorioni, ABastanzio, GSbraccia, MMustazza, CSestili, I Synthesis and pharmacological evaluation of bivalent antagonists of the nociceptin opioid receptor. Eur J Med Chem46:1207-21 (2011) 
 
Nociceptin receptor
Name:Nociceptin receptor
Type:G Protein-Coupled Receptor (GPCR)
Mol. Mass.:40702.87
Organism:Homo sapiens (Human)
Description:P41146
Residue:370
BDBM50340708
NameBDBM50340708
Synonyms:3-(9-(dimethylamino)nonyl)-8-(4-isopropylcyclohexyl)-1-phenyl-1,3,8-triazaspiro[4.5]decan-4-one | CHEMBL1762372
TypeSmall organic molecule
Emp. Form.C33H56N4O
Mol. Mass.524.8239
SMILESCC(C)[C@H]1CC[C@H](CC1)N1CCC2(CC1)N(CN(CCCCCCCCCN(C)C)C2=O)c1ccccc1