Reaction Details
TargetNociceptin receptor
LigandBDBM50340712
Substrate/Competitorn/a
Meas. Tech.ChEMBL_740151 (CHEMBL1763211)
IC50 83.3±n/a nM
Citation Del Giudice, MRBorioni, ABastanzio, GSbraccia, MMustazza, CSestili, I Synthesis and pharmacological evaluation of bivalent antagonists of the nociceptin opioid receptor. Eur J Med Chem46:1207-21 (2011) 
 
Nociceptin receptor
Name:Nociceptin receptor
Type:G Protein-Coupled Receptor (GPCR)
Mol. Mass.:40702.87
Organism:Homo sapiens (Human)
Description:P41146
Residue:370
BDBM50340712
NameBDBM50340712
Synonyms:(E,E)-N,N'-bis[[4-[[2-[[(4-amino-2-methylquinolin-6-yl)amino]carbonyl]phenyl]methoxy]phenyl]methylene]-1,6-hexanediamine | CHEMBL1762376
TypeSmall organic molecule
Emp. Form.C56H54N8O4
Mol. Mass.903.0792
SMILESCc1cc(N)c2cc(NC(=O)c3ccccc3COc3ccc(\C=N\CCCCCC\N=C\c4ccc(OCc5ccccc5C(=O)Nc5ccc6nc(C)cc(N)c6c5)cc4)cc3)ccc2n1