Reaction Details
Target11-beta-hydroxysteroid dehydrogenase 1
LigandBDBM50340818
Substrate/Competitorn/a
Meas. Tech.ChEMBL_740555 (CHEMBL1764756)
IC50 1.5±n/a nM
Citation Sun, WMaletic, MMundt, SSShah, KZokian, HLyons, KWaddell, STBalkovec, J Substituted phenyl triazoles as selective inhibitors of 11 β-Hydroxysteroid Dehydrogenase Type 1. Bioorg Med Chem Lett21:2141-5 (2011) 
 
11-beta-hydroxysteroid dehydrogenase 1
Name:11-beta-hydroxysteroid dehydrogenase 1
Type:Enzyme
Mol. Mass.:32409.16
Organism:Homo sapiens (Human)
Description:P28845
Residue:292
BDBM50340818
NameBDBM50340818
Synonyms:3-chloro-6-(4-(5-(1-(4-chlorophenyl)cyclobutyl)-4-methyl-4H-1,2,4-triazol-3-yl)phenyl)pyridazine | CHEMBL1760796
TypeSmall organic molecule
Emp. Form.C23H19Cl2N5
Mol. Mass.436.336
SMILESCn1c(nnc1C1(CCC1)c1ccc(Cl)cc1)-c1ccc(cc1)-c1ccc(Cl)nn1