Reaction Details
Target11-beta-hydroxysteroid dehydrogenase 1
LigandBDBM50340819
Substrate/Competitorn/a
Meas. Tech.ChEMBL_740556 (CHEMBL1764757)
IC50 1.1±n/a nM
Citation Sun, WMaletic, MMundt, SSShah, KZokian, HLyons, KWaddell, STBalkovec, J Substituted phenyl triazoles as selective inhibitors of 11 β-Hydroxysteroid Dehydrogenase Type 1. Bioorg Med Chem Lett21:2141-5 (2011) 
 
11-beta-hydroxysteroid dehydrogenase 1
Name:11-beta-hydroxysteroid dehydrogenase 1
Type:Enzyme
Mol. Mass.:32369.70
Organism:Mus musculus (mouse)
Description:P50172
Residue:292
BDBM50340819
NameBDBM50340819
Synonyms:6-(4-(5-(1-(4-chlorophenyl)cyclobutyl)-4-methyl-4H-1,2,4-triazol-3-yl)phenyl)pyridazin-3-amine | CHEMBL1760797
TypeSmall organic molecule
Emp. Form.C23H21ClN6
Mol. Mass.416.906
SMILESCn1c(nnc1C1(CCC1)c1ccc(Cl)cc1)-c1ccc(cc1)-c1ccc(N)nn1