Reaction Details
TargetAurora kinase A
LigandBDBM50340956
Substrate/Competitorn/a
Meas. Tech.ChEMBL_740044 (CHEMBL1763104)
IC50 6200±n/a nM
Citation Zagotto, GRedaelli, MPasquale, RD'Avella, DCozza, GDenaro, LPizzato, FMucignat-Caretta, C 8-Hydroxynaphthalene-1,4-dione derivative as novel compound for glioma treatment. Bioorg Med Chem Lett21:2079-82 (2011) 
 
Aurora kinase A
Name:Aurora kinase A
Type:Serine/threonine-protein kinase
Mol. Mass.:45830.98
Organism:Homo sapiens (Human)
Description:O14965
Residue:403
BDBM50340956
NameBDBM50340956
Synonyms:5,8-dihydroxy-2-(2,3,4-trihydroxyphenyl)naphthalene-1,4-dione | CHEMBL1762119
TypeSmall organic molecule
Emp. Form.C16H10O7
Mol. Mass.314.2464
SMILESOc1ccc(C2=CC(=O)c3c(O)ccc(O)c3C2=O)c(O)c1O