Reaction Details
TargetPolyphenol oxidase 2
LigandBDBM50296246
Substrate/Competitorn/a
Meas. Tech.ChEMBL_740346 (CHEMBL1764347)
IC50 8000±n/a nM
Citation Takahashi, TMiyazawa, M Synthesis and structure-activity relationships of phenylpropanoid amides of serotonin on tyrosinase inhibition. Bioorg Med Chem Lett21:1983-6 (2011) 
 
Polyphenol oxidase 2
Name:Polyphenol oxidase 2
Type:Protein
Mol. Mass.:63923.66
Organism:Agaricus bisporus (Common mushroom)
Description:O42713
Residue:556
BDBM50296246
NameBDBM50296246
Synonyms:CHEMBL564482 | N-Feruloylserotonin
TypeSmall organic molecule
Emp. Form.C20H20N2O4
Mol. Mass.352.3838
SMILESCOc1cc(\C=C\C(=O)NCCc2c[nH]c3ccc(O)cc23)ccc1O