Reaction Details
TargetAdenosine receptor A2b
LigandBDBM50341188
Substrate/Competitorn/a
Meas. Tech.ChEMBL_740589 (CHEMBL1764852)
Ki 5±n/a nM
Citation Firooznia, FCheung, AWBrinkman, JGrimsby, JGubler, MLHamid, RMarcopulos, NRamsey, GTan, JWen, YSarabu, R Discovery of benzothiazole-based adenosine A2B receptor antagonists with improved A2A selectivity. Bioorg Med Chem Lett21:1933-6 (2011) 
 
Adenosine receptor A2b
Name:Adenosine receptor A2b
Type:G Protein-Coupled Receptor (GPCR)
Mol. Mass.:36341.22
Organism:Homo sapiens (Human)
Description:n/a
Residue:332
BDBM50341188
NameBDBM50341188
Synonyms:CHEMBL1760899 | N-(7-(N-ethylacetamido)-4-methoxybenzo[d]thiazol-2-yl)-4-hydroxy-4-(3-(trifluoromethyl)phenyl)piperidine-1-carboxamide
TypeSmall organic molecule
Emp. Form.C25H27F3N4O4S
Mol. Mass.536.566
SMILESCCN(C(C)=O)c1ccc(OC)c2nc(NC(=O)N3CCC(O)(CC3)c3cccc(c3)C(F)(F)F)sc12