Reaction Details
TargetAdenosine receptor A2b
LigandBDBM50321522
Substrate/Competitorn/a
Meas. Tech.ChEMBL_740586 (CHEMBL1764849)
IC50 6±n/a nM
Citation Firooznia, FCheung, AWBrinkman, JGrimsby, JGubler, MLHamid, RMarcopulos, NRamsey, GTan, JWen, YSarabu, R Discovery of benzothiazole-based adenosine A2B receptor antagonists with improved A2A selectivity. Bioorg Med Chem Lett21:1933-6 (2011) 
 
Adenosine receptor A2b
Name:Adenosine receptor A2b
Type:G Protein-Coupled Receptor (GPCR)
Mol. Mass.:36341.22
Organism:Homo sapiens (Human)
Description:n/a
Residue:332
BDBM50321522
NameBDBM50321522
Synonyms:CHEMBL1171164 | N-(7-(N-ethylacetamido)-4-methoxybenzo[d]thiazol-2-yl)-1-(3-(trifluoromethyl)benzyl)-1H-pyrazole-4-carboxamide
TypeSmall organic molecule
Emp. Form.C24H22F3N5O3S
Mol. Mass.517.523
SMILESCCN(C(C)=O)c1ccc(OC)c2nc(NC(=O)c3cnn(Cc4cccc(c4)C(F)(F)F)c3)sc12