Reaction Details
TargetSodium-dependent noradrenaline transporter
LigandBDBM50322529
Substrate/Competitorn/a
Meas. Tech.ChEMBL_741840 (CHEMBL1769985)
IC50 32±n/a nM
Citation Carroll, FIMuresan, AZBlough, BENavarro, HAMascarella, SWEaton, JBHuang, XDamaj, MILukas, RJ Synthesis of 2-(substituted phenyl)-3,5,5-trimethylmorpholine analogues and their effects on monoamine uptake, nicotinic acetylcholine receptor function, and behavioral effects of nicotine. J Med Chem54:1441-8 (2011) 
 
Sodium-dependent noradrenaline transporter
Name:Sodium-dependent noradrenaline transporter
Type:Multi-pass membrane protein
Mol. Mass.:69337.72
Organism:Homo sapiens (Human)
Description:P23975
Residue:617
BDBM50322529
NameBDBM50322529
Synonyms:(2S,3S)-2-(3-Fluorophenyl)-3,5,5-trimethylmorpholin-2-ol | CHEMBL1173275
TypeSmall organic molecule
Emp. Form.C13H18FNO2
Mol. Mass.239.2859
SMILESC[C@@H]1NC(C)(C)CO[C@@]1(O)c1cccc(F)c1