Reaction Details
TargetEstrogen receptor beta
LigandBDBM50323701
Substrate/Competitorn/a
Meas. Tech.ChEMBL_741543 (CHEMBL1769326)
EC50 900±n/a nM
Citation Möcklinghoff, Svan Otterlo, WARose, RFuchs, SZimmermann, TJDominguez Seoane, MWaldmann, HOttmann, CBrunsveld, L Design and evaluation of fragment-like estrogen receptor tetrahydroisoquinoline ligands from a scaffold-detection approach. J Med Chem54:2005-11 (2011) 
 
Estrogen receptor beta
Name:Estrogen receptor beta
Type:Protein
Mol. Mass.:59238.43
Organism:Homo sapiens (Human)
Description:Q92731
Residue:530
BDBM50323701
NameBDBM50323701
Synonyms:2-(Trifluoroacetyl)-1,2,3,4-tetrahydro-6-isoquinolinol | CHEMBL1213617
TypeSmall organic molecule
Emp. Form.C11H10F3NO2
Mol. Mass.245.1978
SMILESOc1ccc2CN(CCc2c1)C(=O)C(F)(F)F