Reaction Details
TargetCarbonic anhydrase 7
LigandBDBM50341582
Substrate/Competitorn/a
Meas. Tech.ChEMBL_743885 (CHEMBL1767828)
Ki 6.4±n/a nM
Citation Mader, PBrynda, JGitto, RAgnello, SPachl, PSupuran, CTChimirri, AŘezáčová, P Structural basis for the interaction between carbonic anhydrase and 1,2,3,4-tetrahydroisoquinolin-2-ylsulfonamides. J Med Chem54:2522-6 (2011) 
 
Carbonic anhydrase 7
Name:Carbonic anhydrase 7
Type:Enzyme
Mol. Mass.:29664.11
Organism:Homo sapiens (Human)
Description:Human cloned isozyme.
Residue:264
BDBM50341582
NameBDBM50341582
Synonyms:6,7-Dimethoxy-1-methyl-3,4-dihydroisoquinoline-2(1H)-sulfonamide CHEMBL1089045
TypeSmall organic molecule
Emp. Form.C12H18N2O4S
Mol. Mass.286.347
SMILESCOc1cc2CCN(C(C)c2cc1OC)S(N)(=O)=O