Reaction Details
TargetDNA-dependent protein kinase catalytic subunit
LigandBDBM50341747
Substrate/Competitorn/a
Meas. Tech.ChEMBL_743384 (CHEMBL1767683)
IC50 5600±n/a nM
Citation Charrier, JDDurrant, SJGolec, JMKay, DPKnegtel, RMMacCormick, SMortimore, MO'Donnell, MEPinder, JLReaper, PMRutherford, APWang, PSYoung, SCPollard, JR Discovery of potent and selective inhibitors of ataxia telangiectasia mutated and Rad3 related (ATR) protein kinase as potential anticancer agents. J Med Chem54:2320-30 (2011) 
 
DNA-dependent protein kinase catalytic subunit
Name:DNA-dependent protein kinase catalytic subunit
Type:Protein
Mol. Mass.:469114.78
Organism:Homo sapiens (Human)
Description:P78527
Residue:4128
BDBM50341747
NameBDBM50341747
Synonyms:3-amino-6-(4-(isopropylsulfonyl)phenyl)-N-phenylpyrazine-2-carboxamide | CHEMBL1766793
TypeSmall organic molecule
Emp. Form.C20H20N4O3S
Mol. Mass.396.463
SMILESCC(C)S(=O)(=O)c1ccc(cc1)-c1cnc(N)c(n1)C(=O)Nc1ccccc1