Reaction Details
TargetSerine/threonine-protein kinase ATR
LigandBDBM50341746
Substrate/Competitorn/a
Meas. Tech.ChEMBL_743338 (CHEMBL1767585)
IC50 12±n/a nM
Citation Charrier, JDDurrant, SJGolec, JMKay, DPKnegtel, RMMacCormick, SMortimore, MO'Donnell, MEPinder, JLReaper, PMRutherford, APWang, PSYoung, SCPollard, JR Discovery of potent and selective inhibitors of ataxia telangiectasia mutated and Rad3 related (ATR) protein kinase as potential anticancer agents. J Med Chem54:2320-30 (2011) 
 
Serine/threonine-protein kinase ATR
Name:Serine/threonine-protein kinase ATR
Type:Protein
Mol. Mass.:301404.58
Organism:Homo sapiens (Human)
Description:Q13535
Residue:2644
BDBM50341746
NameBDBM50341746
Synonyms:3-amino-6-(4-(ethylsulfonyl)phenyl)-N-phenylpyrazine-2-carboxamide | CHEMBL1766792
TypeSmall organic molecule
Emp. Form.C19H18N4O3S
Mol. Mass.382.436
SMILESCCS(=O)(=O)c1ccc(cc1)-c1cnc(N)c(n1)C(=O)Nc1ccccc1