Reaction Details
TargetSerine/threonine-protein kinase ATR
LigandBDBM50341742
Substrate/Competitorn/a
Meas. Tech.ChEMBL_743338 (CHEMBL1767585)
IC50 54±n/a nM
Citation Charrier, JDDurrant, SJGolec, JMKay, DPKnegtel, RMMacCormick, SMortimore, MO'Donnell, MEPinder, JLReaper, PMRutherford, APWang, PSYoung, SCPollard, JR Discovery of potent and selective inhibitors of ataxia telangiectasia mutated and Rad3 related (ATR) protein kinase as potential anticancer agents. J Med Chem54:2320-30 (2011) 
 
Serine/threonine-protein kinase ATR
Name:Serine/threonine-protein kinase ATR
Type:Protein
Mol. Mass.:301404.58
Organism:Homo sapiens (Human)
Description:Q13535
Residue:2644
BDBM50341742
NameBDBM50341742
Synonyms:3-amino-N-phenyl-6-(4-(pyrrolidine-1-carbonyl)phenyl)-pyrazine-2-carboxamide US10479784, Compound I-70 | US10961232, Compound I-70
TypeSmall organic molecule
Emp. Form.C22H21N5O2
Mol. Mass.387.4344
SMILESNc1ncc(nc1C(=O)Nc1ccccc1)-c1ccc(cc1)C(=O)N1CCCC1