Reaction Details
TargetSerine/threonine-protein kinase ATR
LigandBDBM489325
Substrate/Competitorn/a
Meas. Tech.ChEMBL_743338 (CHEMBL1767585)
IC50 22±n/a nM
Citation Charrier, JDDurrant, SJGolec, JMKay, DPKnegtel, RMMacCormick, SMortimore, MO'Donnell, MEPinder, JLReaper, PMRutherford, APWang, PSYoung, SCPollard, JR Discovery of potent and selective inhibitors of ataxia telangiectasia mutated and Rad3 related (ATR) protein kinase as potential anticancer agents. J Med Chem54:2320-30 (2011) 
 
Serine/threonine-protein kinase ATR
Name:Serine/threonine-protein kinase ATR
Type:Protein
Mol. Mass.:301404.58
Organism:Homo sapiens (Human)
Description:Q13535
Residue:2644
BDBM489325
NameBDBM489325
Synonyms:3-(benzo[d]thiazol-2-yl)-5-(4-(methylsulfonyl)phenyl)pyrazin-2-amine US10961232, Compound I-146
TypeSmall organic molecule
Emp. Form.C18H14N4O2S2
Mol. Mass.382.459
SMILESCS(=O)(=O)c1ccc(cc1)-c1cnc(N)c(n1)-c1nc2ccccc2s1