Reaction Details
TargetSerine-protein kinase ATM
LigandBDBM50341719
Substrate/Competitorn/a
Meas. Tech.ChEMBL_743383 (CHEMBL1767682)
IC50 320±n/a nM
Citation Charrier, JDDurrant, SJGolec, JMKay, DPKnegtel, RMMacCormick, SMortimore, MO'Donnell, MEPinder, JLReaper, PMRutherford, APWang, PSYoung, SCPollard, JR Discovery of potent and selective inhibitors of ataxia telangiectasia mutated and Rad3 related (ATR) protein kinase as potential anticancer agents. J Med Chem54:2320-30 (2011) 
 
Serine-protein kinase ATM
Name:Serine-protein kinase ATM
Type:Protein
Mol. Mass.:350696.72
Organism:Homo sapiens (Human)
Description:Q13315
Residue:3056
BDBM50341719
NameBDBM50341719
Synonyms:3-amino-6-(2-cyanophenyl)-N-phenylpyrazine-2-carboxamide | CHEMBL1766765
TypeSmall organic molecule
Emp. Form.C18H13N5O
Mol. Mass.315.3287
SMILESNc1ncc(nc1C(=O)Nc1ccccc1)-c1ccccc1C#N