Reaction Details
TargetSerine-protein kinase ATM
LigandBDBM50341756
Substrate/Competitorn/a
Meas. Tech.ChEMBL_743383 (CHEMBL1767682)
IC50 840±n/a nM
Citation Charrier, JDDurrant, SJGolec, JMKay, DPKnegtel, RMMacCormick, SMortimore, MO'Donnell, MEPinder, JLReaper, PMRutherford, APWang, PSYoung, SCPollard, JR Discovery of potent and selective inhibitors of ataxia telangiectasia mutated and Rad3 related (ATR) protein kinase as potential anticancer agents. J Med Chem54:2320-30 (2011) 
 
Serine-protein kinase ATM
Name:Serine-protein kinase ATM
Type:Protein
Mol. Mass.:350696.72
Organism:Homo sapiens (Human)
Description:Q13315
Residue:3056
BDBM50341756
NameBDBM50341756
Synonyms:3-(benzoxazol-2-yl)-5-(4-(methylsulfonyl)phenyl)pyrazin-2-amine | CHEMBL1766802
TypeSmall organic molecule
Emp. Form.C18H14N4O3S
Mol. Mass.366.394
SMILESCS(=O)(=O)c1ccc(cc1)-c1cnc(N)c(n1)-c1nc2ccccc2o1