Reaction Details
TargetSerine/threonine-protein kinase ATR
LigandBDBM50341740
Substrate/Competitorn/a
Meas. Tech.ChEMBL_743386 (CHEMBL1767685)
IC50 1000±n/a nM
Citation Charrier, JDDurrant, SJGolec, JMKay, DPKnegtel, RMMacCormick, SMortimore, MO'Donnell, MEPinder, JLReaper, PMRutherford, APWang, PSYoung, SCPollard, JR Discovery of potent and selective inhibitors of ataxia telangiectasia mutated and Rad3 related (ATR) protein kinase as potential anticancer agents. J Med Chem54:2320-30 (2011) 
 
Serine/threonine-protein kinase ATR
Name:Serine/threonine-protein kinase ATR
Type:Protein
Mol. Mass.:301404.58
Organism:Homo sapiens (Human)
Description:Q13535
Residue:2644
BDBM50341740
NameBDBM50341740
Synonyms:3-amino-6-(4-(azetidine-1-carbonyl)phenyl)-N-phenylpyrazine-2-carboxamide US10479784, Compound I-72 | US10961232, Compound I-72
TypeSmall organic molecule
Emp. Form.C21H19N5O2
Mol. Mass.373.4079
SMILESNc1ncc(nc1C(=O)Nc1ccccc1)-c1ccc(cc1)C(=O)N1CCC1