Reaction Details
TargetHistone deacetylase 3
LigandBDBM50341853
Substrate/Competitorn/a
Meas. Tech.ChEMBL_743699 (CHEMBL1767468)
IC50 18400±n/a nM
Citation Botta, CBCabri, WCini, EDe Cesare, LFattorusso, CGiannini, GPersico, MPetrella, ARondinelli, FRodriquez, MRusso, ATaddei, M Oxime amides as a novel zinc binding group in histone deacetylase inhibitors: synthesis, biological activity, and computational evaluation. J Med Chem54:2165-82 (2011) 
 
Histone deacetylase 3
Name:Histone deacetylase 3
Type:Enzyme
Mol. Mass.:48829.55
Organism:Homo sapiens (Human)
Description:O15379
Residue:428
BDBM50341853
NameBDBM50341853
Synonyms:2-(Hydroxyimino)-N1-methyl-N9-(3-(pyridine-3-yl)phenyl)nonanediamide | CHEMBL1767038
TypeSmall organic molecule
Emp. Form.C21H26N4O3
Mol. Mass.382.4561
SMILESCNC(=O)C(CCCCCCC(=O)Nc1cccc(c1)-c1cccnc1)N=O