Reaction Details
TargetHistone deacetylase 9
LigandBDBM19149
Substrate/Competitorn/a
Meas. Tech.ChEMBL_743705 (CHEMBL1767519)
IC50 20±n/a nM
Citation Botta, CBCabri, WCini, EDe Cesare, LFattorusso, CGiannini, GPersico, MPetrella, ARondinelli, FRodriquez, MRusso, ATaddei, M Oxime amides as a novel zinc binding group in histone deacetylase inhibitors: synthesis, biological activity, and computational evaluation. J Med Chem54:2165-82 (2011) 
 
Histone deacetylase 9
Name:Histone deacetylase 9
Type:Enzyme
Mol. Mass.:111304.31
Organism:Homo sapiens (Human)
Description:Q9UKV0
Residue:1011
BDBM19149
NameBDBM19149
Synonyms:CHEMBL98 SAHA US10188756, Compound SAHA US11505523, Compound SAHA US9353061, SAHA US9695181, Vorinostat Zolinza suberoylanilide hydroxamic acid
TypeSmall organic molecule
Emp. Form.C14H20N2O3
Mol. Mass.264.3202
SMILESONC(=O)CCCCCCC(=O)Nc1ccccc1