Reaction Details
TargetHistone deacetylase 11
LigandBDBM50341839
Substrate/Competitorn/a
Meas. Tech.ChEMBL_743707 (CHEMBL1767521)
IC50 16800±n/a nM
Citation Botta, CBCabri, WCini, EDe Cesare, LFattorusso, CGiannini, GPersico, MPetrella, ARondinelli, FRodriquez, MRusso, ATaddei, M Oxime amides as a novel zinc binding group in histone deacetylase inhibitors: synthesis, biological activity, and computational evaluation. J Med Chem54:2165-82 (2011) 
 
Histone deacetylase 11
Name:Histone deacetylase 11
Type:Chromatin regulator; hydrolase; repressor
Mol. Mass.:39187.66
Organism:Homo sapiens (Human)
Description:Q96DB2
Residue:347
BDBM50341839
NameBDBM50341839
Synonyms:5-(3-Aminophenyl)-N-(7-(hydroxyimino)-8-(methylamino)-8-oxooctyl)isoxazole-3-carboxamide | CHEMBL1767043
TypeSmall organic molecule
Emp. Form.C19H25N5O4
Mol. Mass.387.4329
SMILESCNC(=O)C(CCCCCCNC(=O)c1cc(on1)-c1cccc(N)c1)N=O