Reaction Details
TargetCyclin-H/Cyclin-dependent kinase 7
LigandBDBM50341878
Substrate/Competitorn/a
Meas. Tech.ChEMBL_743898 (CHEMBL1767841)
IC50 160±n/a nM
Citation Jorda, RHavlícek, LMcNae, IWWalkinshaw, MDVoller, JSturc, ANavrátilová, JKuzma, MMistrík, MBártek, JStrnad, MKrystof, V Pyrazolo[4,3-d]pyrimidine bioisostere of roscovitine: evaluation of a novel selective inhibitor of cyclin-dependent kinases with antiproliferative activity. J Med Chem54:2980-93 (2011) 
 
Cyclin-H/Cyclin-dependent kinase 7
Name:Cyclin-H/Cyclin-dependent kinase 7
Type:Protein Complex
Mol. Mass.:n/a
Description:n/a
Components:This complex has 2 components.
Component 1
Name:Cyclin-H
Synonyms:CCNH Cyclin H p34 | p37
Type:Enzyme Subunit
Mol. Mass.:37646.05
Organism:Homo sapiens (Human)
Description:n/a
Residue:323
Component 2
Name:Cyclin-dependent kinase 7
Synonyms:39 kDa protein kinase CAK1 CDK-activating kinase 1 (CAK) CDK7_HUMAN Cell division protein kinase 7 Cyclin-dependent kinase 7 (CDK7/cyclin H) P39 Mo15 TFIIH basal transcription factor complex kinase subunit
Type:Enzyme Subunit
Mol. Mass.:39047.01
Organism:Homo sapiens (Human)
Description:n/a
Residue:346
BDBM50341878
NameBDBM50341878
Synonyms:(2R)-2-{[7-(benzylamino)-3-(propan-2-yl)-1H-pyrazolo[4,3-d]pyrimidin-5-yl]amino}butan-1-ol CHEMBL1738742
TypeSmall organic molecule
Emp. Form.C19H26N6O
Mol. Mass.354.4493
SMILESCC[C@H](CO)Nc1nc(NCc2ccccc2)c2n[nH]c(C(C)C)c2n1