Reaction Details
TargetCyclin-dependent kinase 5 activator 1
LigandBDBM7533
Substrate/Competitorn/a
Meas. Tech.ChEMBL_743897 (CHEMBL1767840)
IC50 940±n/a nM
Citation Jorda, RHavlícek, LMcNae, IWWalkinshaw, MDVoller, JSturc, ANavrátilová, JKuzma, MMistrík, MBártek, JStrnad, MKrystof, V Pyrazolo[4,3-d]pyrimidine bioisostere of roscovitine: evaluation of a novel selective inhibitor of cyclin-dependent kinases with antiproliferative activity. J Med Chem54:2980-93 (2011) 
 
Cyclin-dependent kinase 5 activator 1
Name:Cyclin-dependent kinase 5 activator 1
Type:Protein Complex
Mol. Mass.:n/a
Description:n/a
Components:This complex has 2 components.
Component 1
Name:Cyclin-dependent kinase 5
Synonyms:CDK5 CDKN5 Cyclin-dependent kinase 5 (CDK5/ p25) Cyclin-dependent-like kinase 5 PSSALRE Tau protein kinase II catalytic subunit
Type:Enzyme Subunit
Mol. Mass.:33308.61
Organism:Homo sapiens (Human)
Description:n/a
Residue:292
Component 2
Name:Cyclin-dependent kinase 5 activator 1
Synonyms:CD5R1_HUMAN CDK5R1 Cyclin-dependent kinase 5 (CDK5/p25) NCK5A p35
Type:Enzyme Subunit
Mol. Mass.:34077.43
Organism:Homo sapiens (Human)
Description:Q15078
Residue:307
BDBM7533
NameBDBM7533
Synonyms:(2R)-2-[[6-(benzylamino)-9-isopropyl-purin-2-yl]amino]butan-1-ol (2R)-2-[[6-[(phenylmethyl)amino]-9-propan-2-yl-2-purinyl]amino]-1-butanol (2R)-2-{[6-(benzylamino)-9-(propan-2-yl)-9H-purin-2-yl]amino}butan-1-ol 2,6,9-Trisubstituted purine deriv. 28 CYC-202 cid_160355
TypeSmall organic molecule
Emp. Form.C19H26N6O
Mol. Mass.354.4493
SMILESCC[C@H](CO)Nc1nc(NCc2ccccc2)c2ncn(C(C)C)c2n1