Reaction Details
TargetCannabinoid receptor 2
LigandBDBM50341919
Substrate/Competitorn/a
Meas. Tech.ChEMBL_743422 (CHEMBL1767776)
IC50 4.90±n/a nM
Citation Manley, PJZartman, APaone, DVBurgey, CSHenze, DADella Penna, KDesai, RLeitl, MDLemaire, WWhite, RBYeh, SUrban, MOKane, SAHartman, GDBilodeau, MTTrotter, BW Decahydroquinoline amides as highly selective CB2 agonists: role of selectivity on in vivo efficacy in a rodent model of analgesia. Bioorg Med Chem Lett21:2359-64 (2011) 
 
Cannabinoid receptor 2
Name:Cannabinoid receptor 2
Type:G Protein-Coupled Receptor (GPCR)
Mol. Mass.:39690.94
Organism:Homo sapiens (Human)
Description:P34972
Residue:360
BDBM50341919
NameBDBM50341919
Synonyms:((4aR,8aS)-4-hydroxy-4-phenyloctahydroquinolin-1(2H)-yl)(1H-indazol-4-yl)methanone CHEMBL1765278
TypeSmall organic molecule
Emp. Form.C23H25N3O2
Mol. Mass.375.4635
SMILESOC1(CCN([C@H]2CCCC[C@@H]12)C(=O)c1cccc2[nH]ncc12)c1ccccc1