Reaction Details
TargetCannabinoid receptor 1
LigandBDBM50341932
Substrate/Competitorn/a
Meas. Tech.ChEMBL_743423 (CHEMBL1767777)
IC50>17000±n/a nM
Citation Manley, PJZartman, APaone, DVBurgey, CSHenze, DADella Penna, KDesai, RLeitl, MDLemaire, WWhite, RBYeh, SUrban, MOKane, SAHartman, GDBilodeau, MTTrotter, BW Decahydroquinoline amides as highly selective CB2 agonists: role of selectivity on in vivo efficacy in a rodent model of analgesia. Bioorg Med Chem Lett21:2359-64 (2011) 
 
Cannabinoid receptor 1
Name:Cannabinoid receptor 1
Type:G Protein-Coupled Receptor (GPCR)
Mol. Mass.:52868.96
Organism:Homo sapiens (Human)
Description:P21554
Residue:472
BDBM50341932
NameBDBM50341932
Synonyms:CHEMBL1765248 | cis-((4R,4aS,8aR)-4-hydroxy-4-phenyloctahydroquinolin-1(2H)-yl)(1-methylpyrrolidin-3-yl)methanone
TypeSmall organic molecule
Emp. Form.C21H30N2O2
Mol. Mass.342.4751
SMILESCN1CCC(C1)C(=O)N1CC[C@@](O)([C@H]2CCCC[C@@H]12)c1ccccc1