Reaction Details
TargetCannabinoid receptor 2
LigandBDBM50341969
Substrate/Competitorn/a
Meas. Tech.ChEMBL_743422 (CHEMBL1767776)
IC50 338±n/a nM
Citation Manley, PJZartman, APaone, DVBurgey, CSHenze, DADella Penna, KDesai, RLeitl, MDLemaire, WWhite, RBYeh, SUrban, MOKane, SAHartman, GDBilodeau, MTTrotter, BW Decahydroquinoline amides as highly selective CB2 agonists: role of selectivity on in vivo efficacy in a rodent model of analgesia. Bioorg Med Chem Lett21:2359-64 (2011) 
 
Cannabinoid receptor 2
Name:Cannabinoid receptor 2
Type:G Protein-Coupled Receptor (GPCR)
Mol. Mass.:39690.94
Organism:Homo sapiens (Human)
Description:P34972
Residue:360
BDBM50341969
NameBDBM50341969
Synonyms:CHEMBL1765255 | trans-((4R,4aS,8aS)-4-hydroxy-4-(3-(methylsulfonyl)phenyl)octahydroquinolin-1(2H)-yl)(phenyl)methanone
TypeSmall organic molecule
Emp. Form.C23H27NO4S
Mol. Mass.413.53
SMILESCS(=O)(=O)c1cccc(c1)[C@@]1(O)CCN([C@H]2CCCC[C@H]12)C(=O)c1ccccc1