Reaction Details
TargetCannabinoid receptor 2
LigandBDBM50341944
Substrate/Competitorn/a
Meas. Tech.ChEMBL_743422 (CHEMBL1767776)
IC50 282±n/a nM
Citation Manley, PJZartman, APaone, DVBurgey, CSHenze, DADella Penna, KDesai, RLeitl, MDLemaire, WWhite, RBYeh, SUrban, MOKane, SAHartman, GDBilodeau, MTTrotter, BW Decahydroquinoline amides as highly selective CB2 agonists: role of selectivity on in vivo efficacy in a rodent model of analgesia. Bioorg Med Chem Lett21:2359-64 (2011) 
 
Cannabinoid receptor 2
Name:Cannabinoid receptor 2
Type:G Protein-Coupled Receptor (GPCR)
Mol. Mass.:39690.94
Organism:Homo sapiens (Human)
Description:P34972
Residue:360
BDBM50341944
NameBDBM50341944
Synonyms:CHEMBL1765269 | cis-rac-((4S,4aR,8aS)-4-hydroxy-4-phenyloctahydroquinolin-1(2H)-yl)(4H-1,2,4-triazol-3-yl)methanone
TypeSmall organic molecule
Emp. Form.C18H22N4O2
Mol. Mass.326.3929
SMILESO[C@]1(CCN([C@H]2CCCC[C@@H]12)C(=O)c1nnc[nH]1)c1ccccc1