Reaction Details
TargetCannabinoid receptor 2
LigandBDBM50341952
Substrate/Competitorn/a
Meas. Tech.ChEMBL_743428 (CHEMBL1767782)
IC50 81±n/a nM
Citation Manley, PJZartman, APaone, DVBurgey, CSHenze, DADella Penna, KDesai, RLeitl, MDLemaire, WWhite, RBYeh, SUrban, MOKane, SAHartman, GDBilodeau, MTTrotter, BW Decahydroquinoline amides as highly selective CB2 agonists: role of selectivity on in vivo efficacy in a rodent model of analgesia. Bioorg Med Chem Lett21:2359-64 (2011) 
 
Cannabinoid receptor 2
Name:Cannabinoid receptor 2
Type:Enzyme
Mol. Mass.:39366.68
Organism:Rattus norvegicus (Rat)
Description:Q9QZN9
Residue:360
BDBM50341952
NameBDBM50341952
Synonyms:((4S,4aR,8aS)-4-hydroxy-4-phenyloctahydroquinolin-1(2H)-yl)((S)-4-methylmorpholin-3-yl)methanone | CHEMBL1765277
TypeSmall organic molecule
Emp. Form.C21H30N2O3
Mol. Mass.358.4745
SMILESCN1CCOC[C@H]1C(=O)N1CC[C@](O)([C@@H]2CCCC[C@H]12)c1ccccc1