Reaction Details
TargetRibonuclease pancreatic
LigandBDBM50342008
Substrate/Competitorn/a
Meas. Tech.ChEMBL_743584 (CHEMBL1768084)
Ki 229000±n/a nM
Citation Samanta, ADasgupta, SPathak, T 5'-Modified pyrimidine nucleosides as inhibitors of ribonuclease A. Bioorg Med Chem19:2478-84 (2011) 
 
Ribonuclease pancreatic
Name:Ribonuclease pancreatic
Type:Enzyme
Mol. Mass.:16468.79
Organism:Bison bison (American bison)
Description:carboxamidomethylated RNase A
Residue:150
BDBM50342008
NameBDBM50342008
Synonyms:1-[2,5-Dideoxy-5-(4-carboxypiperidinyl)-beta-D-threopentofuranosyl]thymine | CHEMBL1765477
TypeSmall organic molecule
Emp. Form.C16H23N3O6
Mol. Mass.353.3703
SMILESCc1cn([C@H]2C[C@@H](O)[C@@H](CN3CCC(CC3)C(O)=O)O2)c(=O)[nH]c1=O